{"text_format":"1","workbook":"xlsx","n_sheets":5,"sheets":["Master List","Form","2017 Graphs","2018 Graphs","1st Quarter 2016 Graphs"],"not_rendered":{"charts":51,"images":1,"macros":1,"external_links":0,"defined_names":17,"comments":0,"pivot_tables":7},"unopened":[],"bounds":{"document_bytes":16777216,"sheet_cells":100000,"rows_first":2000,"rows_last":500,"rows_between":2000,"halvings":0,"cell_chars":16384,"cell_head_chars":4096},"cells_cut":0,"cells_raw":0,"read":"whole","date_system":"1900"}

{"sheet":"Master List","index":0,"n_rows":14,"n_cols":40,"rows_kept":14,"cut":false,"hidden":false,"merged":[]}
["Primary Key Identifier","Last Name","First Name","Month","Day","Year","Day of Week","Time","Shift","Household","Admit/Readmit Date","Type of Incident","If Med Error, Type of Error","Team Member Directly Involved","Team Members Working in Area","Location","Activity","Category of Severity","Responsible Party Notified","Physician Notified","Incident Report Completed","Reported to State Agency","State Report Number","Notes",null,"Month","Shift","Household","Type of Incident","Location","Severity","Responsible Party","Physician Notified","Report Completed","Report to Agency","Activity","Med Error Type","Day of the Week","Day","Year"]
["2017-0001","Smith","Sam","JAN",4,2017,"WED","2:45 AM","Night","Floor 1",null,"FALL",null,null,null,"Resident Room","Unknown","C- No Injury Event","Yes","Yes","Yes","No",null,"Took pillow and laid on the floor",null,"JAN","AM","Floor 1","Fall","Resident Room","A- Unsafe Condition No Event","Yes","Yes","Yes","Yes","Ambulating","Omitted","Mon",1,2017]
["2017-0002","Smith","Sam","JAN",6,2017,"FRI","6:15 AM","AM","Floor 1",null,"Fall",null,null,null,"Resident Room","Standing Up","C- No Injury Event","Yes","Yes","Yes","No",null,null,null,"FEB","PM","Floor 2","Skin","Bathroom","B- Near Miss, Event did not reach resident","No","No","No","No","Transferring","Wrong Med","Tue",2,2018]
["2017-0003","Smith","Sam","JAN",8,2017,"SUN","4:35 AM","Night","Floor 2",null,"FALL",null,null,null,"Dining Room","Standing Up","C- No Injury Event","Yes","Yes","Yes","No",null,null,null,"MAR","NIGHT","Floor 3","PU-Facility Acquired","Hall","C- No Injury Event","No per request",null,null,null,"In Bed","Wrong Dose","Wed",3]
["2017-0004","Smith","Sam","JAN",9,2017,"MON","3:30 PM","PM","Floor 2",null,"Fall",null,null,null,"Resident Room","In Chair","C- No Injury Event","Yes","Yes","Yes","No",null,"Slid out of Wheelchair",null,"APR",null,"Floor 4","PU-Present at Admission","Dining Room","D- No harm, but monitoring needed ex. Skin tear",null,null,null,null,"In Chair","Wrong Time","Thu",4]
["2017-0005","Smith","Sam","JAN",9,2017,"MON","10:00 PM","PM","Floor 3",null,"FALL",null,null,null,"Resident Room","Transferring","C- No Injury Event","Yes","Yes","Yes","No",null,null,null,"MAY",null,"Floor 5","Med Error","Living Room","E- Temporary harm, ex. Sutures",null,null,null,null,"Toileting","Duplication","Fri",5]
["2017-0006","Smith","Sam","JAN","10-11",2017,"TUE","HS","PM","Floor 3",null,"Med Error",null,null,null,"Resident Room",null,"C- No Injury Event","Yes","Yes","Yes","No",null,"wrong strength administered",null,"JUN",null,"Floor 6","Elopement","N/A","F- Temporary harm with hospitalization ex. PU with hosptialization for tx",null,null,null,null,"Reaching/Leaning","N/A","Sat",6]
["2017-0007","Frank","Bob","JAN","11",2017,"WED","8:00 AM","AM","Floor 4",null,"Med Error",null,null,null,"Dining Room",null,"C- No Injury Event","Yes","Yes","Yes","No",null,"Meds Omitted",null,"JUL",null,"Floor 7","Missing Item","Other","G- May have contributed to permanent harm ex. Bone fracture, surgical intervention",null,null,null,null,"Standing Up",null,"Sun",7]
{"$rows_left_out":7}
{"sheet":"Form","index":1,"n_rows":2,"n_cols":2,"rows_kept":2,"cut":false,"hidden":false,"merged":[]}
[]
[null,"Use this button to launch the Form for accessing the data in a more graphical format"]

{"sheet":"2017 Graphs","index":2,"n_rows":228,"n_cols":22,"rows_kept":228,"cut":false,"hidden":false,"merged":[]}
[]
[]
[null,null,"Incidents By Count",null,null,"2017 Full Year","2017 Jan","Feb","March","Apr","May","June","July","Aug","Sept","Oct","Nov","Dec","q1","q2","q3","q4"]
[]
[null,null,"Fall",null,null,{"$f":"COUNTIFS('Master List'!L2:L400, \"FALL\",'Master List'!F2:F400, \"2017\")","v":11},{"$f":"COUNTIFS('Master List'!L2:L400, \"FALL\", 'Master List'!D2:D400, \"JAN\")","v":11},{"$f":"COUNTIFS('Master List'!L2:L400, \"FALL\", 'Master List'!D2:D400, \"Feb\", 'Master List'!F2:F400, \"2017\")","v":0},{"$f":"COUNTIFS('Master List'!L2:L400, \"FALL\", 'Master List'!D2:D400, \"Mar\", 'Master List'!F2:F400, \"2017\")","v":0},{"$f":"COUNTIFS('Master List'!L2:L400, \"FALL\", 'Master List'!D2:D400, \"apr\", 'Master List'!F2:F400, \"2017\")","v":0},{"$f":"COUNTIFS('Master List'!L2:L400, \"FALL\", 'Master List'!D2:D400, \"may\", 'Master List'!F2:F400, \"2017\")","v":0},{"$f":"COUNTIFS('Master List'!L2:L400,\"FALL\",'Master List'!D2:D400,\"JUN\", 'Master List'!F2:F400, \"2017\")","v":0},{"$f":"COUNTIFS('Master List'!L2:L400, \"FALL\", 'Master List'!D2:D400, \"JUL\", 'Master List'!F2:F400, \"2017\")","v":0},{"$f":"COUNTIFS('Master List'!L2:L400, \"FALL\", 'Master List'!D2:D400, \"Aug\", 'Master List'!F2:F400, \"2017\")","v":0},{"$f":"COUNTIFS('Master List'!L2:L400, \"FALL\", 'Master List'!D2:D400, \"sep\", 'Master List'!F2:F400, \"2017\")","v":0},{"$f":"COUNTIFS('Master List'!L2:L400, \"FALL\", 'Master List'!D2:D400, \"oct\", 'Master List'!F2:F400, \"2017\")","v":0},{"$f":"COUNTIFS('Master List'!L2:L400, \"FALL\", 'Master List'!D2:D400, \"nov\", 'Master List'!F2:F400, \"2017\")","v":0},{"$f":"COUNTIFS('Master List'!L2:L400, \"FALL\", 'Master List'!D2:D400, \"Dec\", 'Master List'!F2:F400, \"2017\")","v":0},{"$f":"SUM(G5:I5)","v":11},{"$f":"SUM(J5:L5)","v":0},{"$f":"SUM(M5:O5)","v":0},{"$f":"SUM(P5:R5)","v":0}]
[null,null,"Skin",null,null,{"$f":"COUNTIFS('Master List'!L2:L400, \"skin\",'Master List'!L2:L400, \"2017\")","v":0},{"$f":"COUNTIFS('Master List'!L2:L400, \"skin\", 'Master List'!D2:D400, \"JAN\", 'Master List'!F2:F400, \"2017\")","v":0},{"$f":"COUNTIFS('Master List'!L2:L400, \"skin\", 'Master List'!D2:D400, \"feb\", 'Master List'!F2:F400, \"2017\")","v":0},{"$f":"COUNTIFS('Master List'!L2:L400, \"skin\", 'Master List'!D2:D400, \"mar\", 'Master List'!F2:F400, \"2017\")","v":0},{"$f":"COUNTIFS('Master List'!L2:L400, \"skin\", 'Master List'!D2:D400, \"apr\", 'Master List'!F2:F400, \"2017\")","v":0},{"$f":"COUNTIFS('Master List'!L2:L400, \"skin\", 'Master List'!D2:D400, \"May\", 'Master List'!F2:F400, \"2017\")","v":0},{"$f":"COUNTIFS('Master List'!L2:L400, \"skin\", 'Master List'!D2:D400, \"jun\", 'Master List'!F2:F400, \"2017\")","v":0},{"$f":"COUNTIFS('Master List'!L2:L400, \"skin\", 'Master List'!D2:D400, \"Jul\", 'Master List'!F2:F400, \"2017\")","v":0},{"$f":"COUNTIFS('Master List'!L2:L400, \"skin\", 'Master List'!D2:D400, \"aug\", 'Master List'!F2:F400, \"2017\")","v":0},{"$f":"COUNTIFS('Master List'!L2:L400, \"skin\", 'Master List'!D2:D400, \"sep\", 'Master List'!F2:F400, \"2017\")","v":0},{"$f":"COUNTIFS('Master List'!L2:L400, \"skin\", 'Master List'!D2:D400, \"oct\", 'Master List'!F2:F400, \"2017\")","v":0},{"$f":"COUNTIFS('Master List'!L2:L400, \"skin\", 'Master List'!D2:D400, \"nov\", 'Master List'!F2:F400, \"2017\")","v":0},{"$f":"COUNTIFS('Master List'!L2:L400, \"skin\", 'Master List'!D2:D400, \"dec\", 'Master List'!F2:F400, \"2017\")","v":0},0,{"$f":"SUM(J6:L6)","v":0},{"$f":"SUM(M6:O6)","v":0},{"$f":"SUM(P6:R6)","v":0}]
[null,null,"PU-Facility Acquired",null,null,{"$f":"COUNTIFS('Master List'!L2:L400, \"PU-Facility Acquired\", 'Master List'!F2:F400, \"2017\")","v":0},{"$f":"COUNTIFS('Master List'!L2:L400, \"PU-Facility Acquired\", 'Master List'!D2:D400, \"JAN\", 'Master List'!F2:F400, \"2017\")","v":0},{"$f":"COUNTIFS('Master List'!L2:L400, \"PU-Facility Acquired\", 'Master List'!D2:D400, \"feb\", 'Master List'!F2:F400, \"2017\")","v":0},{"$f":"COUNTIFS('Master List'!L2:L400, \"PU-Facility Acquired\", 'Master List'!D2:D400, \"mar\", 'Master List'!F2:F400, \"2017\")","v":0},{"$f":"COUNTIFS('Master List'!L2:L400, \"PU-Facility Acquired\", 'Master List'!D2:D400, \"apr\", 'Master List'!F2:F400, \"2017\")","v":0},{"$f":"COUNTIFS('Master List'!L2:L400, \"PU-Facility Acquired\", 'Master List'!D2:D400, \"May\", 'Master List'!F2:F400, \"2017\")","v":0},{"$f":"COUNTIFS('Master List'!L2:L400, \"PU-Facility Acquired\", 'Master List'!D2:D400, \"jun\", 'Master List'!F2:F400, \"2017\")","v":0},{"$f":"COUNTIFS('Master List'!L2:L400, \"PU-Facility Acquired\", 'Master List'!D2:D400, \"Jul\", 'Master List'!F2:F400, \"2017\")","v":0},{"$f":"COUNTIFS('Master List'!L2:L400, \"PU-Facility Acquired\", 'Master List'!D2:D400, \"aug\", 'Master List'!F2:F400, \"2017\")","v":0},{"$f":"COUNTIFS('Master List'!L2:L400, \"PU-Facility Acquired\", 'Master List'!D2:D400, \"sep\", 'Master List'!F2:F400, \"2017\")","v":0},{"$f":"COUNTIFS('Master List'!L2:L400, \"PU-Facility Acquired\", 'Master List'!D2:D400, \"oct\", 'Master List'!F2:F400, \"2017\")","v":0},{"$f":"COUNTIFS('Master List'!L2:L400, \"PU-Facility Acquired\", 'Master List'!D2:D400, \"nov\", 'Master List'!F2:F400, \"2017\")","v":0},{"$f":"COUNTIFS('Master List'!L2:L400, \"PU-Facility Acquired\", 'Master List'!D2:D400, \"dec\")","v":0},0,0,0,0]
[null,null,"PU-Present at Admission",null,null,{"$f":"COUNTIFS('Master List'!L2:L400, \"PU-Present at Admission\", 'Master List'!F2:F400, \"2017\")","v":0},{"$f":"COUNTIFS('Master List'!L2:L400, \"PU-Present at Admission\", 'Master List'!D2:D400, \"JAN\", 'Master List'!F2:F400, \"2017\")","v":0},{"$f":"COUNTIFS('Master List'!L2:L400,  \"PU-Present at Admission\", 'Master List'!D2:D400, \"feb\", 'Master List'!F2:F400, \"2017\")","v":0},{"$f":"COUNTIFS('Master List'!L2:L400,  \"PU-Present at Admission\", 'Master List'!D2:D400, \"mar\", 'Master List'!F2:F400, \"2017\")","v":0},{"$f":"COUNTIFS('Master List'!L2:L400,  \"PU-Present at Admission\", 'Master List'!D2:D400, \"apr\", 'Master List'!F2:F400, \"2017\")","v":0},{"$f":"COUNTIFS('Master List'!L2:L400,  \"PU-Present at Admission\", 'Master List'!D2:D400, \"May\", 'Master List'!F2:F400, \"2017\")","v":0},{"$f":"COUNTIFS('Master List'!L2:L400,  \"PU-Present at Admission\", 'Master List'!D2:D400, \"jun\", 'Master List'!F2:F400, \"2017\")","v":0},{"$f":"COUNTIFS('Master List'!L2:L400,  \"PU-Present at Admission\", 'Master List'!D2:D400, \"Jul\", 'Master List'!F2:F400, \"2017\")","v":0},{"$f":"COUNTIFS('Master List'!L2:L400,  \"PU-Present at Admission\", 'Master List'!D2:D400, \"aug\", 'Master List'!F2:F400, \"2017\")","v":0},{"$f":"COUNTIFS('Master List'!L2:L400,  \"PU-Present at Admission\", 'Master List'!D2:D400, \"sep\", 'Master List'!F2:F400, \"2017\")","v":0},{"$f":"COUNTIFS('Master List'!L2:L400,  \"PU-Present at Admission\", 'Master List'!D2:D400, \"oct\", 'Master List'!F2:F400, \"2017\")","v":0},{"$f":"COUNTIFS('Master List'!L2:L400,  \"PU-Present at Admission\", 'Master List'!D2:D400, \"nov\", 'Master List'!F2:F400, \"2017\")","v":0},{"$f":"COUNTIFS('Master List'!L2:L400,  \"PU-Present at Admission\", 'Master List'!D2:D400, \"dec\", 'Master List'!F2:F400, \"2017\")","v":0},0,0,0,0]
{"$rows_left_out":221}
{"sheet":"2018 Graphs","index":3,"n_rows":228,"n_cols":22,"rows_kept":228,"cut":false,"hidden":false,"merged":[]}
[]
[]
[null,null,"Incidents By Count",null,null,"2018 Full Year","2018 Jan","Feb","March","Apr","May","June","July","Aug","Sept","Oct","Nov","Dec","q1","q2","q3","q4"]
[]
[null,null,"Fall",null,null,{"$f":"COUNTIFS('Master List'!L2:L600, \"FALL\",'Master List'!F2:F600, \"2018\")","v":0},{"$f":"COUNTIFS('Master List'!L2:L600, \"FALL\", 'Master List'!D2:D600, \"JAN\")","v":11},{"$f":"COUNTIFS('Master List'!L2:L600, \"FALL\", 'Master List'!D2:D600, \"Feb\", 'Master List'!F2:F600, \"2018\")","v":0},{"$f":"COUNTIFS('Master List'!L2:L600, \"FALL\", 'Master List'!D2:D600, \"Mar\", 'Master List'!F2:F600, \"2018\")","v":0},{"$f":"COUNTIFS('Master List'!L2:L600, \"FALL\", 'Master List'!D2:D600, \"apr\", 'Master List'!F2:F600, \"2018\")","v":0},{"$f":"COUNTIFS('Master List'!L2:L600, \"FALL\", 'Master List'!D2:D600, \"may\", 'Master List'!F2:F600, \"2018\")","v":0},{"$f":"COUNTIFS('Master List'!L2:L600,\"FALL\",'Master List'!D2:D600,\"JUN\", 'Master List'!F2:F600, \"2018\")","v":0},{"$f":"COUNTIFS('Master List'!L2:L600, \"FALL\", 'Master List'!D2:D600, \"JUL\", 'Master List'!F2:F600, \"2018\")","v":0},{"$f":"COUNTIFS('Master List'!L2:L600, \"FALL\", 'Master List'!D2:D600, \"Aug\", 'Master List'!F2:F600, \"2018\")","v":0},{"$f":"COUNTIFS('Master List'!L2:L600, \"FALL\", 'Master List'!D2:D600, \"sep\", 'Master List'!F2:F600, \"2018\")","v":0},{"$f":"COUNTIFS('Master List'!L2:L600, \"FALL\", 'Master List'!D2:D600, \"oct\", 'Master List'!F2:F600, \"2018\")","v":0},{"$f":"COUNTIFS('Master List'!L2:L600, \"FALL\", 'Master List'!D2:D600, \"nov\", 'Master List'!F2:F600, \"2018\")","v":0},{"$f":"COUNTIFS('Master List'!L2:L600, \"FALL\", 'Master List'!D2:D600, \"Dec\", 'Master List'!F2:F600, \"2018\")","v":0},{"$f":"SUM(G5:I5)","v":11},{"$f":"SUM(J5:L5)","v":0},{"$f":"SUM(M5:O5)","v":0},{"$f":"SUM(P5:R5)","v":0}]
[null,null,"Skin",null,null,{"$f":"COUNTIFS('Master List'!L2:L600, \"skin\",'Master List'!L2:L600, \"2018\")","v":0},{"$f":"COUNTIFS('Master List'!L2:L600, \"skin\", 'Master List'!D2:D600, \"JAN\", 'Master List'!F2:F600, \"2018\")","v":0},{"$f":"COUNTIFS('Master List'!L2:L600, \"skin\", 'Master List'!D2:D600, \"feb\", 'Master List'!F2:F600, \"2018\")","v":0},{"$f":"COUNTIFS('Master List'!L2:L600, \"skin\", 'Master List'!D2:D600, \"mar\", 'Master List'!F2:F600, \"2018\")","v":0},{"$f":"COUNTIFS('Master List'!L2:L600, \"skin\", 'Master List'!D2:D600, \"apr\", 'Master List'!F2:F600, \"2018\")","v":0},{"$f":"COUNTIFS('Master List'!L2:L600, \"skin\", 'Master List'!D2:D600, \"May\", 'Master List'!F2:F600, \"2018\")","v":0},{"$f":"COUNTIFS('Master List'!L2:L600, \"skin\", 'Master List'!D2:D600, \"jun\", 'Master List'!F2:F600, \"2018\")","v":0},{"$f":"COUNTIFS('Master List'!L2:L600, \"skin\", 'Master List'!D2:D600, \"Jul\", 'Master List'!F2:F600, \"2018\")","v":0},{"$f":"COUNTIFS('Master List'!L2:L600, \"skin\", 'Master List'!D2:D600, \"aug\", 'Master List'!F2:F600, \"2018\")","v":0},{"$f":"COUNTIFS('Master List'!L2:L600, \"skin\", 'Master List'!D2:D600, \"sep\", 'Master List'!F2:F600, \"2018\")","v":0},{"$f":"COUNTIFS('Master List'!L2:L600, \"skin\", 'Master List'!D2:D600, \"oct\", 'Master List'!F2:F600, \"2018\")","v":0},{"$f":"COUNTIFS('Master List'!L2:L600, \"skin\", 'Master List'!D2:D600, \"nov\", 'Master List'!F2:F600, \"2018\")","v":0},{"$f":"COUNTIFS('Master List'!L2:L600, \"skin\", 'Master List'!D2:D600, \"dec\", 'Master List'!F2:F600, \"2018\")","v":0},0,{"$f":"SUM(J6:L6)","v":0},{"$f":"SUM(M6:O6)","v":0},{"$f":"SUM(P6:R6)","v":0}]
[null,null,"PU-Facility Acquired",null,null,{"$f":"COUNTIFS('Master List'!L2:L600, \"PU-Facility Acquired\", 'Master List'!F2:F600, \"2018\")","v":0},{"$f":"COUNTIFS('Master List'!L2:L600, \"PU-Facility Acquired\", 'Master List'!D2:D600, \"JAN\", 'Master List'!F2:F600, \"2018\")","v":0},{"$f":"COUNTIFS('Master List'!L2:L600, \"PU-Facility Acquired\", 'Master List'!D2:D600, \"feb\", 'Master List'!F2:F600, \"2018\")","v":0},{"$f":"COUNTIFS('Master List'!L2:L600, \"PU-Facility Acquired\", 'Master List'!D2:D600, \"mar\", 'Master List'!F2:F600, \"2018\")","v":0},{"$f":"COUNTIFS('Master List'!L2:L600, \"PU-Facility Acquired\", 'Master List'!D2:D600, \"apr\", 'Master List'!F2:F600, \"2018\")","v":0},{"$f":"COUNTIFS('Master List'!L2:L600, \"PU-Facility Acquired\", 'Master List'!D2:D600, \"May\", 'Master List'!F2:F600, \"2018\")","v":0},{"$f":"COUNTIFS('Master List'!L2:L600, \"PU-Facility Acquired\", 'Master List'!D2:D600, \"jun\", 'Master List'!F2:F600, \"2018\")","v":0},{"$f":"COUNTIFS('Master List'!L2:L600, \"PU-Facility Acquired\", 'Master List'!D2:D600, \"Jul\", 'Master List'!F2:F600, \"2018\")","v":0},{"$f":"COUNTIFS('Master List'!L2:L600, \"PU-Facility Acquired\", 'Master List'!D2:D600, \"aug\", 'Master List'!F2:F600, \"2018\")","v":0},{"$f":"COUNTIFS('Master List'!L2:L600, \"PU-Facility Acquired\", 'Master List'!D2:D600, \"sep\", 'Master List'!F2:F600, \"2018\")","v":0},{"$f":"COUNTIFS('Master List'!L2:L600, \"PU-Facility Acquired\", 'Master List'!D2:D600, \"oct\", 'Master List'!F2:F600, \"2018\")","v":0},{"$f":"COUNTIFS('Master List'!L2:L600, \"PU-Facility Acquired\", 'Master List'!D2:D600, \"nov\", 'Master List'!F2:F600, \"2018\")","v":0},{"$f":"COUNTIFS('Master List'!L2:L600, \"PU-Facility Acquired\", 'Master List'!D2:D600, \"dec\")","v":0},0,0,0,0]
[null,null,"PU-Present at Admission",null,null,{"$f":"COUNTIFS('Master List'!L2:L600, \"PU-Present at Admission\", 'Master List'!F2:F600, \"2018\")","v":0},{"$f":"COUNTIFS('Master List'!L2:L600, \"PU-Present at Admission\", 'Master List'!D2:D600, \"JAN\", 'Master List'!F2:F600, \"2018\")","v":0},{"$f":"COUNTIFS('Master List'!L2:L600,  \"PU-Present at Admission\", 'Master List'!D2:D600, \"feb\", 'Master List'!F2:F600, \"2018\")","v":0},{"$f":"COUNTIFS('Master List'!L2:L600,  \"PU-Present at Admission\", 'Master List'!D2:D600, \"mar\", 'Master List'!F2:F600, \"2018\")","v":0},{"$f":"COUNTIFS('Master List'!L2:L600,  \"PU-Present at Admission\", 'Master List'!D2:D600, \"apr\", 'Master List'!F2:F600, \"2018\")","v":0},{"$f":"COUNTIFS('Master List'!L2:L600,  \"PU-Present at Admission\", 'Master List'!D2:D600, \"May\", 'Master List'!F2:F600, \"2018\")","v":0},{"$f":"COUNTIFS('Master List'!L2:L600,  \"PU-Present at Admission\", 'Master List'!D2:D600, \"jun\", 'Master List'!F2:F600, \"2018\")","v":0},{"$f":"COUNTIFS('Master List'!L2:L600,  \"PU-Present at Admission\", 'Master List'!D2:D600, \"Jul\", 'Master List'!F2:F600, \"2018\")","v":0},{"$f":"COUNTIFS('Master List'!L2:L600,  \"PU-Present at Admission\", 'Master List'!D2:D600, \"aug\", 'Master List'!F2:F600, \"2018\")","v":0},{"$f":"COUNTIFS('Master List'!L2:L600,  \"PU-Present at Admission\", 'Master List'!D2:D600, \"sep\", 'Master List'!F2:F600, \"2018\")","v":0},{"$f":"COUNTIFS('Master List'!L2:L600,  \"PU-Present at Admission\", 'Master List'!D2:D600, \"oct\", 'Master List'!F2:F600, \"2018\")","v":0},{"$f":"COUNTIFS('Master List'!L2:L600,  \"PU-Present at Admission\", 'Master List'!D2:D600, \"nov\", 'Master List'!F2:F600, \"2018\")","v":0},{"$f":"COUNTIFS('Master List'!L2:L600,  \"PU-Present at Admission\", 'Master List'!D2:D600, \"dec\", 'Master List'!F2:F600, \"2018\")","v":0},0,0,0,0]
{"$rows_left_out":221}
{"sheet":"1st Quarter 2016 Graphs","index":4,"n_rows":126,"n_cols":2,"rows_kept":126,"cut":false,"hidden":false,"merged":[]}
["Primary Key Identifier","(All)"]
["Month","(Multiple Items)"]
[]
["Row Labels","Count of Type of Incident"]
["ELOPEMENT",1]
["FALL",57]
["MED ERROR",12]
["OTHER",5]
{"$rows_left_out":118}